{"text_format":"1","workbook":"xlsx","n_sheets":4,"sheets":["Planes Corporativos","Formato Emisión de la Póliza","Declaración de Viajes","Hoja3"],"not_rendered":{"charts":0,"images":2,"macros":0,"external_links":0,"defined_names":4,"comments":0,"pivot_tables":0},"unopened":[],"bounds":{"document_bytes":16777216,"sheet_cells":100000,"rows_first":2000,"rows_last":500,"rows_between":2000,"halvings":0,"cell_chars":16384,"cell_head_chars":4096},"cells_cut":0,"cells_raw":0,"read":"whole","date_system":"1900"}

{"sheet":"Planes Corporativos","index":0,"n_rows":32,"n_cols":8,"rows_kept":32,"cut":false,"hidden":false,"merged":[[27,0,27,8],[28,0,28,8],[29,0,29,8],[8,6,8,8],[14,6,15,6],[16,6,17,6],[18,6,19,6],[14,7,15,8],[11,6,11,8],[30,0,30,8],[31,0,31,8],[26,0,26,8],[9,6,9,8],[10,6,10,8],[12,6,13,8],[16,7,17,8],[18,7,19,8],[0,6,1,8],[0,0,1,5],[5,6,5,8],[2,6,2,8],[6,6,6,8],[7,6,7,8],[3,6,3,8],[4,6,4,8]]}
["SEGURO DE VIAJES CORPORATIVO "]
[]
["Coberturas y sumas aseguradas","Ejecutivo Nacional","Ejecutivo \nBásico","Ejecutivo  Plus","Ejecutivo\nSenior Plus","Ejecutivo \nPremium Plus","¿Cómo calcular la bolsa de días que necesito?"]
["Gastos Médicos",null,null,null,null,null,"1. Calcular el número promedio de ejecutivos que viajan por año"]
["Asistencia médica en caso de accidente o enfermedad no preexistente","US$ 15,000","US$ 30,000","US$ 50,000","US$ 150,000","US$ 250,000","2. Calcular el número promedio de viajes que viajan por año"]
["Primera atención médica en caso de enfermedad preexistente","US$ 300","US$ 300","US$ 400","US$ 500","US$ 800","3. Calcular el número promedio de días viaje de los ejecutivos"]
["Gastos odontológicos por emergencia","US$ 500","US$ 500","US$ 500","US$ 1,500","US$ 2,500","Ejemplo:"]
["Medicamentos por hospitalización o atención ambulatoria","Incluido en \nAsistencia Médica","Incluido en Asistencia Médica","Incluido en \nAsistencia Médica","Incluido en \nAsistencia Médica","Incluido en Asistencia Médica","1. Dieciocho (18) ejecutivos que viajan en la empresa de manera regular."]
["Estadía en Hotel por Enfermedad o Accidente hasta por 10 días","US$ 500\n(US$ 50 diarios)","US$ 1,000\n(US$ 100 diarios)","US$ 1,000\n(US$ 100 diarios)","US$ 2,000\n(US$ 200 diarios)","US$ 4,000\n(US$ 400 diarios)","2. Los ejecutivos viajan 10 veces al año aproximadamente."]
["Acompañante en caso de hospitalización","SI (pasaje ida y vuelta en clase económica)","SI (pasaje ida y vuelta en clase económica)","SI (pasaje ida y vuelta en clase económica)","SI (pasaje ida y vuelta en clase económica)","SI (pasaje ida y vuelta en clase económica)","3. La estadía de viajes de los ejecutivos es de 4 días aproximadamente."]
["Alojamiento familiar acompañante hasta por 10 días","-","US$ 1,000\n(US$ 100 diarios)","US$ 1,000\n(US$ 100 diarios)","US$ 2,000\n(US$ 200 diarios)","US$ 4,000\n(US$ 400 diarios)","Ejemplo: La Bolsa de días sería de: 18*10*4= 720 días"]
["Imprevistos en el Viaje"]
["Pérdida del Equipaje hasta","US$ 500\n(US$ 50/Kg.)","US$ 1,200\n(US$ 50/Kg.)","US$ 1,200\n(US$ 50/Kg.)","US$ 1,200\n(US$ 50/Kg.)"," US$ 1,200\n(US$ 50/Kg.)","Cotización"]
["Compensación por demora en la localización de \nequipaje (a partir de 24 horas)","US$ 250","US$ 500","US$ 500","US$ 1,000","US$ 1,000"]
["Cancelación del viaje (accidente, muerte o enfermedad)","-","US$ 500","US$ 500","US$ 1,000","US$ 3,000","Seleccione el plan a contratar de la sgte lista:"]
["Retraso del viaje (por clima, falla del equipo, huelga)","-","US$ 500","US$ 500","US$ 1,000","US$ 3,000"]
["Regreso anticipado del viaje (accidente, muerte o enfermedad o siniestro grave en domicilio)","-","US$ 500","US$ 700","US$ 1,000","US$ 3,000","Ingrese el número de días a contratar"]
["Reemplazo de Ejecutivo","-","SI (pasaje ida y vuelta en clase económica)","SI (pasaje ida y vuelta en clase económica)","SI (pasaje ida y vuelta en clase económica)","SI (pasaje ida y vuelta en clase económica)"]
["Robo de computador portátil","-","US$ 250","US$ 250","US$ 500","US$ 1,000","Prima Total (US$)",{"$f":"+IFERROR(IF(H17=\"\",\"\",IF(H17>=100,H17*Hoja3!H5,\"Adquirir mínimo 100 días\")),\"\")","v":""}]
["Asistencia jurídica","-","US$ 5,000","US$ 8,000","US$ 10,000","US$ 20,000"]
["Pago de Fianzas","-","US$ 5,000","US$ 8,000","US$ 10,000","US$ 20,000"]
["Servicio de asistencias en viaje","Incluido","Incluido","Incluido","Incluido","Incluido"]
["Accidentes Personales"]
["Muerte Accidental ","US$ 20,000","US$ 25,000","US$ 50,000","US$ 50,000","US$ 100,000"]
["Traslado de restos mortales o evacuación médica","US$ 5,000","US$ 5,000","US$ 40,000","US$ 40,000","US$ 40,000"]
["Prima total por día","US$ 3.50","US$ 4.00","US$ 5.00","US$ 6.00","US$ 8.50"]
[]
["§  Mínimo de días a contratar: Bolsa de 100 días"]
["§  Edad límite de contratación: 75 años"]
["§  A partir de los 70 años, la cobertura de gastos médicos son al 50%"]
["§  Cubre todos los países del mundo excepto: Afganistán, Burma, Cuba, República Democrática del Congo, Irán, Irak, Liberia, Sudan o Siria. "]
["§  No tiene deducibles"]

{"sheet":"Formato Emisión de la Póliza","index":1,"n_rows":153,"n_cols":6,"rows_kept":153,"cut":false,"hidden":false,"merged":[[18,4,18,5],[19,4,21,4],[8,4,8,5],[9,4,10,5],[11,4,11,5],[12,4,12,5],[13,4,14,5],[15,4,15,5],[17,1,17,3],[3,1,3,3],[4,1,4,3],[0,4,1,5],[2,4,2,5],[3,4,3,5],[4,4,4,5],[5,4,5,5],[6,4,6,5],[7,4,7,5],[6,1,6,3],[7,1,7,3],[1,0,1,3],[10,1,10,3],[11,1,11,3],[14,1,14,3],[16,1,16,3],[0,0,0,3],[18,1,18,3],[2,0,2,3],[8,1,8,3],[12,1,12,3],[13,1,13,3],[9,0,9,3],[15,1,15,3],[5,1,5,3]]}
["FORMATO DE SOLICITUD DE SEGURO DE VIAJE COLECTIVO",null,null,null,"Preguntas Frecuentes"]
["Llenar este formato y enviarlo al buzón multiviajes: polizasmultiviaje@pacifico.com.pe"]
["CONTRATANTE",null,null,null,"Tiempo de Atención"]
["Apellidos y Nombres o Razon Social *",null,null,null,"¿Cuál es el horario de atención del buzón multiviajes?"]
["DNI o RUC*",null,null,null,"El buzón multiviajes atiende de Lunes a Viernes de 9am. a 6pm."]
["Dirección*",null,null,null,"¿Cuánto tiempo tardarán en atender mi solicitud?"]
["Distrito/ Provincia*",null,null,null,"El buzón multiviajes atenderá las solicitudes en máximo 4 horas."]
["Dirección electrónica de facturación*",null,null,null,"Forma de Pago"]
["Teléfono",null,null,null,"¿Cómo puedo pagar mi póliza de viajes?"]
["DATOS DE LA PÓLIZA",null,null,null,"Se puede pagar a través de un depósito en la cuenta recaudadora  o pagando en caja en Pacífico. En cualquiera de los casos, enviar el comprobante de pago al buzón multiviajes."]
["Plan*"]
["Prima por día",{"$f":"IFERROR(VLOOKUP(B11,Hoja3!C4:D8,2,0),\"\")","v":""},null,null,"¿Cuál es el número de la cuenta recaudadora de Pacífico?"]
["Nro de días*",null,null,null,"Cuenta Recaudadora Pacífico BCP Dólares: 193-1111071-1-49. Indicar DNI o RUC"]
["Prima Total",{"$f":"+IFERROR(IF(B13=\"\",\"\",IF(B13>=100,B13*B12,\"Adquirir mínimo 100 días\")),\"\")","v":""},null,null,"Para pagos por internet: Entrar a su cuenta BCP y realice los siguientes pasos:                              Pago de Servicios >> Pacífico Peruano Suiza >> Recaudación Multiviajes >> Digitar DNI o RUC >> Poner el importe de la póliza."]
["Agente (Broker)"]
["Canal",null,null,null,"Depósito en Cuenta Interbancaria: 00219300111107114913"]
["Vendedor"]
["Forma de pago"]
["Nro cuotas",null,null,null,"Envío de la póliza"]
["* Datos obligatorios",null,null,null,"Pacífico es una empresa socialmente responsable y busca cuidar el medio ambiente evitando las impresiones. Por lo tanto, el envío de la póliza se realiza por e-mail en formato PDF y de manera inmediata. "]
[]
[]
[]
[]
[]
[]
[]
[]
[]
[]
[]
[]
[]
[]
[]
[]
[]
[]
[]
[]
[]
[]
[]
[]
[]
[]
[]
[]
[]
[]
[]
[]
[]
[]
[]
[]
[]
[]
[]
[]
[]
[]
[]
[]
[]
[]
[]
[]
[]
[]
[]
[]
[]
[]
[]
[]
[]
[]
[]
[]
[]
[]
[]
[]
[]
[]
[]
[]
[]
[]
[]
[]
[]
[]
[]
[]
[]
[]
[]
[]
[]
[]
[]
[]
[]
[]
[]
[]
[]
[]
[]
[]
[]
[]
[]
[]
[]
[]
[]
[]
[]
[]
[]
[]
[]
[]
[]
[]
[]
[]
[]
[]
[]
[]
[]
[]
[]
[]
[]
[]
[]
[]
[]
[]
[]
[]
[]
[]
[]
[]
[]
[null,null,null,null,null,false]
[null,null,null,null,null,false]

{"sheet":"Declaración de Viajes","index":2,"n_rows":26,"n_cols":14,"rows_kept":26,"cut":false,"hidden":false,"merged":[[6,7,6,11],[0,1,0,5],[0,7,1,11],[1,1,1,5],[2,1,2,5],[2,7,2,11],[3,2,3,5],[3,7,3,11],[8,7,8,11],[9,1,9,5],[9,7,12,11],[10,2,10,5],[11,2,11,5],[4,2,4,5],[4,7,4,11],[5,2,5,5],[5,7,5,11],[6,2,6,5],[14,0,15,0],[14,1,15,1],[14,2,15,2],[14,3,15,3],[14,4,15,4],[14,5,15,5],[14,12,15,12],[14,13,15,13],[7,1,7,5],[14,6,15,6],[14,7,15,7],[14,8,15,8],[14,9,15,9],[14,10,15,10],[14,11,15,11],[8,1,8,5]]}
[null,"FORMATO DE INCLUSIÓN DE PÓLIZA COLECTIVA",null,null,null,null,null,"Preguntas Frecuentes"]
[null,"Llenar este formato y enviar al buzón multiviajes: polizasmultiviaje@pacifico.com.pe"]
[null,"EMPRESA",null,null,null,null,null,"Tiempo de Atención"]
[null,"Apellidos y Nombres o Razon Social *",null,null,null,null,null,"¿Cuál es el horario de atención del buzón multiviajes?"]
[null,"DNI o RUC*",null,null,null,null,null,"El buzón multiviajes atiende de Lunes a Viernes de 9am. a 6pm."]
[null,"Dirección*",null,null,null,null,null,"¿Cuánto tiempo tardarán en atender mi solicitud?"]
[null,"Distrito/ Provincia*",null,null,null,null,null,"El buzón multiviajes atenderá las solicitudes en máximo 4 horas."]
[]
[null,null,null,null,null,null,null,"IMPORTANTE"]
[null,"PÓLIZA",null,null,null,null,null,"Recuerda que puedes declarar los viajes de tu póliza corporativa de manera inmediata y desde la comodidad de tu oficina, sin la intermediación de Pacífico Seguros. Para esto, puedes solicitar la generación de tu usuario y contraseña al portal MLTV Corporativo enviando un correo al buzón multiviajes: polizasmultiviaje@pacifico.com.pe"]
[null,"N° de Póliza"]
[null,"Plan"]
[]
[]
["N°","Apellidos y Nombres","DNI ","Nacionalidad","Fecha de Nacimiento","Dirección","Distrito/ Provincia","Teléfono","Email","Destino","Fecha inicio de viaje","Fecha fin de viaje","Persona de contacto en caso de emergencia","Teléfono de contacto en caso de emergencia"]
[]
[1]
[2]
[3]
[4]
[5]
[6]
[7]
[8]
[9]
[10]

{"sheet":"Hoja3","index":3,"n_rows":8,"n_cols":8,"rows_kept":8,"cut":false,"hidden":true,"merged":[[3,7,3,9]]}
[]
[]
[]
[null,null,"Ejecutivo Nacional",3.5]
[null,null,"Ejecutivo Básico",4,null,null,"Prima por día",{"$f":"IFERROR(VLOOKUP('Planes Corporativos'!H15,Hoja3!C4:D8,2,0),\"\")","v":""}]
[null,null,"Ejecutivo Plus",5]
[null,null,"Ejecutivo Senior Plus",6]
[null,null,"Ejecutivo Premium Plus",8.5]